Skip to content

fix(executor): stop run-from-block reusing the source run's branch state #33029

fix(executor): stop run-from-block reusing the source run's branch state

fix(executor): stop run-from-block reusing the source run's branch state #33029

Triggered via pull request September 25, 2026 02:24
Status Failure
Total duration 6m 38s
Artifacts –

ci.yml

on: pull_request
Detect Version
Detect Version
Detect Desktop Changes
Detect Desktop Changes
Prepare Trigger.dev
Prepare Trigger.dev
Matrix: Build AMD64
Matrix: Build Dev ECR
Matrix: Build ARM64 (GHCR Only)
Matrix: Test and Build / oauth-postgres
Matrix: Test and Build / test-shard
Test and Build  /  Lint and Test
4m 26s
Test and Build / Lint and Test
Test and Build  /  Build App
4m 45s
Test and Build / Build App
Check Docs Changes
Check Docs Changes
Migrate Dev DB  /  Apply Database Migrations
Migrate Dev DB / Apply Database Migrations
Check Desktop Signing Secrets
0s
Check Desktop Signing Secrets
Migrate DB  /  Apply Database Migrations
Migrate DB / Apply Database Migrations
Create Desktop Prerelease
0s
Create Desktop Prerelease
Promote Images
Promote Images
Desktop Prerelease Build  /  Build, Sign, Notarize
Desktop Prerelease Build / Build, Sign, Notarize
Matrix: Create GHCR Manifests
Process Docs  /  Process Documentation Embeddings
Process Docs / Process Documentation Embeddings
Promote Trigger.dev
Promote Trigger.dev
Publish Desktop Prerelease
0s
Publish Desktop Prerelease
Resolve Attestation Subjects
0s
Resolve Attestation Subjects
Prune Desktop Prereleases
0s
Prune Desktop Prereleases
Matrix: Attest Images
Create GitHub Release
0s
Create GitHub Release
Desktop Release  /  Build, Sign, Notarize
Desktop Release / Build, Sign, Notarize
Fit to window
Zoom out
Zoom in

Annotations

5 errors and 3 warnings
Test and Build / Lint and Test
Process completed with exit code 1.
Test and Build / PostgreSQL integration (migrate)
Process completed with exit code 1.
lib/knowledge/__integration__/knowledge-projection.integration.ts > a async writer > serves a new grant before the projector runs, on both rankings: apps/sim/lib/knowledge/__integration__/knowledge-projection.integration.ts#L479
AssertionError: expected [] to deeply equal [ Array(1) ] - Expected + Received - [ - "2dd8f784-5213-4117-bc15-c4414405d16d", - ] + [] ❯ lib/knowledge/__integration__/knowledge-projection.integration.ts:479:31
lib/knowledge/__integration__/knowledge-projection.integration.ts > a sync writer > makes a new chunk searchable, at once or once the projector runs: apps/sim/lib/knowledge/__integration__/knowledge-projection.integration.ts#L519
AssertionError: expected [] to deeply equal [ …(2) ] - Expected + Received - [ - "2dd8f784-5213-4117-bc15-c4414405d16d", - "49aecd31-1a3d-4a21-8547-994836962efc", - ] + [] ❯ lib/knowledge/__integration__/knowledge-projection.integration.ts:519:33
lib/knowledge/__integration__/knowledge-projection.integration.ts > a sync writer > serves a new grant before the projector runs, on both rankings: apps/sim/lib/knowledge/__integration__/knowledge-projection.integration.ts#L479
AssertionError: expected [] to deeply equal [ Array(1) ] - Expected + Received - [ - "2dd8f784-5213-4117-bc15-c4414405d16d", - ] + [] ❯ lib/knowledge/__integration__/knowledge-projection.integration.ts:479:31
Test and Build / PostgreSQL integration (migrate)
Skipping sticky disk commit due to previous step failures
Test and Build / PostgreSQL integration (migrate)
- Step: unknown (failed)
Test and Build / PostgreSQL integration (migrate)
Found 2 failed/cancelled steps in previous workflow steps